{"text_format":"1","workbook":"xlsx","n_sheets":5,"sheets":["計画値","output参考","利益体系Ａ参考","利益体系Ｂ参考","科目体系マスタ"],"not_rendered":{"charts":0,"images":0,"macros":1,"external_links":0,"defined_names":0,"comments":0,"pivot_tables":2},"unopened":[],"bounds":{"document_bytes":16777216,"sheet_cells":100000,"rows_first":2000,"rows_last":500,"rows_between":2000,"halvings":0,"cell_chars":16384,"cell_head_chars":4096},"cells_cut":0,"cells_raw":0,"read":"whole","date_system":"1900"}

{"sheet":"計画値","index":0,"n_rows":60,"n_cols":37,"rows_kept":60,"cut":false,"hidden":false,"merged":[]}
[null,null,"予算","予算","予算","予算","予算","予算","予算","予算","予算","予算","予算","予算"]
[null,null,"2017-04-01","2017-05-01","2017-06-01","2017-07-01","2017-08-01","2017-09-01","2017-10-01","2017-11-01","2017-12-01","2018-01-01","2018-02-01","2018-03-01","年度計"]
["人数","原価要員数",30,30,30,30,30,30,30,30,30,30,30,30]
[null,"販管要員数",15,15,15,15,15,15,15,15,15,15,15,15]
[null,null,null,null,null,null,null,null,null,null,null,null,null,null,null,null,null,null,null,null,null,null,null,null,null,null,null,null,null,null,null,null,null,null,null,null,0]
["ｺｰﾄﾞ","科目名              ","4月","5月","6月","7月","8月","9月","10月","11月","12月","1月","2月","3月","年度計"]
[4111,"売上高",50000000,50000000,45000000,50000000,50000000,50000000,50000000,50000000,40000000,50000000,50000000,60000000,{"$f":"SUM(C7:N7)","v":595000000}]
[5421,"給与(原)",18000000,18000000,18000000,18000000,18000000,18000000,18000000,18000000,18000000,18000000,18000000,23000000,221000000]
[5423,"賞与(原)",null,null,null,null,null,null,null,null,null,null,null,null,0]
[5425,"法定福利費(原)",2520000.0000000005,2520000.0000000005,2520000.0000000005,2520000.0000000005,2520000.0000000005,2520000.0000000005,2520000.0000000005,2520000.0000000005,2520000.0000000005,2520000.0000000005,2520000.0000000005,3220000.0000000005,30940000.000000004]
[5429,"外注委託費(原)",1500000,1500000,1500000,1500000,1500000,1500000,1500000,1500000,0,0,0,0,12000000]
[5442,"賃借料(原)",null,null,null,null,null,null,null,null,null,null,null,null,0]
[5452,"保険料(原)",20000,20000,20000,20000,20000,20000,20000,20000,20000,20000,20000,20000,240000]
[5455,"旅費交通費(原)",6020000,6220000,11220000,7050000,6650000,6650000,7500000,6950000,6350000,6920000,6320000,6720000,84570000]
[5456,"通信費(原)",300000,300000,300000,300000,300000,300000,300000,300000,300000,300000,300000,300000,3600000]
[5457,"接待交際費(原)",null,null,null,null,null,null,null,null,null,null,null,null,0]
[5458,"消耗品費(原)",250000,250000,250000,250000,250000,250000,250000,250000,250000,250000,250000,550000,3300000]
[5459,"運送費(原)",40000,40000,40000,40000,40000,40000,40000,40000,40000,40000,40000,40000,480000]
[5460,"会議費(原)",85000,85000,85000,85000,85000,85000,85000,85000,85000,85000,85000,85000,1020000]
[5461,"書籍代(原)",50000,50000,50000,50000,50000,50000,50000,50000,50000,50000,50000,50000,600000]
[5479,"雑費(原)",null,null,null,null,null,null,null,null,null,null,null,null,0]
[5600,"その他（原）",null,null,null,null,null,null,null,null,null,null,null,null,0]
[5700,"売上原価",{"$f":"SUM(C8:C22)","v":28785000},{"$f":"SUM(D8:D22)","v":28985000},33985000,29815000,29415000,29415000,30265000,29715000,27615000,28185000,27585000,33985000,357750000]
[6000,"売上総利益",{"$f":"C7-C23","v":21215000},{"$f":"D7-D23","v":21015000},11015000,20185000,20585000,20585000,19735000,20285000,12385000,21815000,22415000,26015000,237250000]
[6111,"役員報酬",1000000,1000000,1000000,1000000,1000000,1000000,1000000,1000000,1000000,1000000,1000000,1000000,12000000]
[6112,"給与手当(役員報酬除く）",9000000,9000000,9000000,9000000,9000000,9000000,9000000,9000000,9000000,9000000,9000000,9000000,108000000]
[6114,"賞与",null,null,null,null,null,null,null,null,null,null,null,null,0]
[6116,"法定福利費",1170000,1170000,1170000,1170000,1170000,1170000,1170000,1170000,1170000,1170000,1170000,1170000,14040000]
[6117,"福利厚生費",226000,226000,226000,226000,226000,268000,226000,226000,426000,268000,226000,226000,2996000]
[6122,"顧問報酬",300000,300000,300000,300000,300000,300000,300000,300000,300000,300000,300000,300000,3600000]
[6211,"派遣社員",0,0,0,0,0,0,0,0,0,0,0,0,0]
[6212,"消耗品費",377000,252000,252000,252000,252000,252000,377000,252000,252000,252000,252000,252000,3274000]
[6213,"賃借料",1029600,1029600,1029600,1029600,1029600,1029600,1029600,1029600,1029600,1029600,1029600,1029600,12355200]
[6215,"保険料",0,0,0,1400000,0,0,0,0,0,40000,0,0,1440000]
[6216,"修繕維持費",482000,532000,842000,482000,482000,882000,482000,482000,782000,482000,482000,982000,7394000]
[6217,"租税公課",0,0,600000,15000,0,50000,0,0,0,0,0,50000,715000]
[6218,"減価償却費",290000,290000,290000,290000,290000,290000,290000,290000,290000,290000,290000,290000,3480000]
[6219,"貸倒引当金繰入",0,0,0,0,0,0,0,0,0,0,0,200000,200000]
[6221,"旅費交通費",735000,735000,465000,465000,465000,465000,450000,450000,450000,450000,450000,450000,6030000]
[6222,"通信費",43000,43000,43000,43000,43000,43000,43000,43000,43000,43000,43000,43000,516000]
{"$rows_left_out":21}
{"sheet":"output参考","index":1,"n_rows":414,"n_cols":7,"rows_kept":414,"cut":false,"hidden":false,"merged":[]}
["コード","科目名称","データ名称","年月","金額","利益体系Ａ","利益体系Ｂ"]
[4111,"売上高","予算","2017-04-01",50000000,{"$f":"VLOOKUP(A2,科目体系マスタ!A:D,3,FALSE)","v":"1.売上高"},{"$f":"VLOOKUP(A2,科目体系マスタ!A:D,4,FALSE)","v":"1.売上高"}]
[5421,"給与(原)","予算","2017-04-01",18000000,{"$f":"VLOOKUP(A3,科目体系マスタ!A:D,3,FALSE)","v":"2.売上原価"},{"$f":"VLOOKUP(A3,科目体系マスタ!A:D,4,FALSE)","v":"4.固定費"}]
[5425,"法定福利費(原)","予算","2017-04-01",2520000.0000000005,{"$f":"VLOOKUP(A4,科目体系マスタ!A:D,3,FALSE)","v":"2.売上原価"},{"$f":"VLOOKUP(A4,科目体系マスタ!A:D,4,FALSE)","v":"4.固定費"}]
[5429,"外注委託費(原)","予算","2017-04-01",1500000,{"$f":"VLOOKUP(A5,科目体系マスタ!A:D,3,FALSE)","v":"2.売上原価"},{"$f":"VLOOKUP(A5,科目体系マスタ!A:D,4,FALSE)","v":"2.変動費"}]
[5452,"保険料(原)","予算","2017-04-01",20000,{"$f":"VLOOKUP(A6,科目体系マスタ!A:D,3,FALSE)","v":"2.売上原価"},{"$f":"VLOOKUP(A6,科目体系マスタ!A:D,4,FALSE)","v":"4.固定費"}]
[5455,"旅費交通費(原)","予算","2017-04-01",6020000,{"$f":"VLOOKUP(A7,科目体系マスタ!A:D,3,FALSE)","v":"2.売上原価"},{"$f":"VLOOKUP(A7,科目体系マスタ!A:D,4,FALSE)","v":"2.変動費"}]
[5456,"通信費(原)","予算","2017-04-01",300000,{"$f":"VLOOKUP(A8,科目体系マスタ!A:D,3,FALSE)","v":"2.売上原価"},{"$f":"VLOOKUP(A8,科目体系マスタ!A:D,4,FALSE)","v":"4.固定費"}]
[5458,"消耗品費(原)","予算","2017-04-01",250000,{"$f":"VLOOKUP(A9,科目体系マスタ!A:D,3,FALSE)","v":"2.売上原価"},{"$f":"VLOOKUP(A9,科目体系マスタ!A:D,4,FALSE)","v":"2.変動費"}]
[5459,"運送費(原)","予算","2017-04-01",40000,{"$f":"VLOOKUP(A10,科目体系マスタ!A:D,3,FALSE)","v":"2.売上原価"},{"$f":"VLOOKUP(A10,科目体系マスタ!A:D,4,FALSE)","v":"2.変動費"}]
[5460,"会議費(原)","予算","2017-04-01",85000,{"$f":"VLOOKUP(A11,科目体系マスタ!A:D,3,FALSE)","v":"2.売上原価"},{"$f":"VLOOKUP(A11,科目体系マスタ!A:D,4,FALSE)","v":"2.変動費"}]
[5461,"書籍代(原)","予算","2017-04-01",50000,{"$f":"VLOOKUP(A12,科目体系マスタ!A:D,3,FALSE)","v":"2.売上原価"},{"$f":"VLOOKUP(A12,科目体系マスタ!A:D,4,FALSE)","v":"2.変動費"}]
[5700,"売上原価","予算","2017-04-01",28785000,{"$f":"VLOOKUP(A13,科目体系マスタ!A:D,3,FALSE)","v":{"$error":"#N/A"}},{"$f":"VLOOKUP(A13,科目体系マスタ!A:D,4,FALSE)","v":{"$error":"#N/A"}}]
[6000,"売上総利益","予算","2017-04-01",21215000,{"$f":"VLOOKUP(A14,科目体系マスタ!A:D,3,FALSE)","v":{"$error":"#N/A"}},{"$f":"VLOOKUP(A14,科目体系マスタ!A:D,4,FALSE)","v":{"$error":"#N/A"}}]
[6111,"役員報酬","予算","2017-04-01",1000000,{"$f":"VLOOKUP(A15,科目体系マスタ!A:D,3,FALSE)","v":"4.一般管理費"},{"$f":"VLOOKUP(A15,科目体系マスタ!A:D,4,FALSE)","v":"4.固定費"}]
[6112,"給与手当(役員報酬除く）","予算","2017-04-01",9000000,{"$f":"VLOOKUP(A16,科目体系マスタ!A:D,3,FALSE)","v":"4.一般管理費"},{"$f":"VLOOKUP(A16,科目体系マスタ!A:D,4,FALSE)","v":"4.固定費"}]
[6116,"法定福利費","予算","2017-04-01",1170000,{"$f":"VLOOKUP(A17,科目体系マスタ!A:D,3,FALSE)","v":"4.一般管理費"},{"$f":"VLOOKUP(A17,科目体系マスタ!A:D,4,FALSE)","v":"4.固定費"}]
[6117,"福利厚生費","予算","2017-04-01",226000,{"$f":"VLOOKUP(A18,科目体系マスタ!A:D,3,FALSE)","v":"4.一般管理費"},{"$f":"VLOOKUP(A18,科目体系マスタ!A:D,4,FALSE)","v":"4.固定費"}]
[6122,"顧問報酬","予算","2017-04-01",300000,{"$f":"VLOOKUP(A19,科目体系マスタ!A:D,3,FALSE)","v":"4.一般管理費"},{"$f":"VLOOKUP(A19,科目体系マスタ!A:D,4,FALSE)","v":"4.固定費"}]
[6212,"消耗品費","予算","2017-04-01",377000,{"$f":"VLOOKUP(A20,科目体系マスタ!A:D,3,FALSE)","v":"4.一般管理費"},{"$f":"VLOOKUP(A20,科目体系マスタ!A:D,4,FALSE)","v":"4.固定費"}]
[6213,"賃借料","予算","2017-04-01",1029600,{"$f":"VLOOKUP(A21,科目体系マスタ!A:D,3,FALSE)","v":"4.一般管理費"},{"$f":"VLOOKUP(A21,科目体系マスタ!A:D,4,FALSE)","v":"4.固定費"}]
[6216,"修繕維持費","予算","2017-04-01",482000,{"$f":"VLOOKUP(A22,科目体系マスタ!A:D,3,FALSE)","v":"4.一般管理費"},{"$f":"VLOOKUP(A22,科目体系マスタ!A:D,4,FALSE)","v":"4.固定費"}]
[6218,"減価償却費","予算","2017-04-01",290000,{"$f":"VLOOKUP(A23,科目体系マスタ!A:D,3,FALSE)","v":"4.一般管理費"},{"$f":"VLOOKUP(A23,科目体系マスタ!A:D,4,FALSE)","v":"4.固定費"}]
[6221,"旅費交通費","予算","2017-04-01",735000,{"$f":"VLOOKUP(A24,科目体系マスタ!A:D,3,FALSE)","v":"4.一般管理費"},{"$f":"VLOOKUP(A24,科目体系マスタ!A:D,4,FALSE)","v":"4.固定費"}]
[6222,"通信費","予算","2017-04-01",43000,{"$f":"VLOOKUP(A25,科目体系マスタ!A:D,3,FALSE)","v":"4.一般管理費"},{"$f":"VLOOKUP(A25,科目体系マスタ!A:D,4,FALSE)","v":"4.固定費"}]
[6223,"会議費","予算","2017-04-01",35400,{"$f":"VLOOKUP(A26,科目体系マスタ!A:D,3,FALSE)","v":"4.一般管理費"},{"$f":"VLOOKUP(A26,科目体系マスタ!A:D,4,FALSE)","v":"4.固定費"}]
[6224,"水道光熱費","予算","2017-04-01",45000,{"$f":"VLOOKUP(A27,科目体系マスタ!A:D,3,FALSE)","v":"4.一般管理費"},{"$f":"VLOOKUP(A27,科目体系マスタ!A:D,4,FALSE)","v":"4.固定費"}]
[6225,"支払手数料","予算","2017-04-01",250000,{"$f":"VLOOKUP(A28,科目体系マスタ!A:D,3,FALSE)","v":"4.一般管理費"},{"$f":"VLOOKUP(A28,科目体系マスタ!A:D,4,FALSE)","v":"4.固定費"}]
[6226,"新聞図書費","予算","2017-04-01",9700,{"$f":"VLOOKUP(A29,科目体系マスタ!A:D,3,FALSE)","v":"4.一般管理費"},{"$f":"VLOOKUP(A29,科目体系マスタ!A:D,4,FALSE)","v":"4.固定費"}]
[6227,"銀行手数料","予算","2017-04-01",5000,{"$f":"VLOOKUP(A30,科目体系マスタ!A:D,3,FALSE)","v":"4.一般管理費"},{"$f":"VLOOKUP(A30,科目体系マスタ!A:D,4,FALSE)","v":"4.固定費"}]
[6228,"販促・広告費","予算","2017-04-01",135000,{"$f":"VLOOKUP(A31,科目体系マスタ!A:D,3,FALSE)","v":"4.一般管理費"},{"$f":"VLOOKUP(A31,科目体系マスタ!A:D,4,FALSE)","v":"4.固定費"}]
[6229,"接待交際費","予算","2017-04-01",50000,{"$f":"VLOOKUP(A32,科目体系マスタ!A:D,3,FALSE)","v":"4.一般管理費"},{"$f":"VLOOKUP(A32,科目体系マスタ!A:D,4,FALSE)","v":"4.固定費"}]
[6233,"運送費","予算","2017-04-01",15000,{"$f":"VLOOKUP(A33,科目体系マスタ!A:D,3,FALSE)","v":"4.一般管理費"},{"$f":"VLOOKUP(A33,科目体系マスタ!A:D,4,FALSE)","v":"4.固定費"}]
[7000,"営業利益","予算","2017-04-01",6017300,{"$f":"VLOOKUP(A34,科目体系マスタ!A:D,3,FALSE)","v":{"$error":"#N/A"}},{"$f":"VLOOKUP(A34,科目体系マスタ!A:D,4,FALSE)","v":{"$error":"#N/A"}}]
[8000,"経常利益","予算","2017-04-01",6017300,{"$f":"VLOOKUP(A35,科目体系マスタ!A:D,3,FALSE)","v":{"$error":"#N/A"}},{"$f":"VLOOKUP(A35,科目体系マスタ!A:D,4,FALSE)","v":{"$error":"#N/A"}}]
[4111,"売上高","予算","2017-05-01",50000000,{"$f":"VLOOKUP(A36,科目体系マスタ!A:D,3,FALSE)","v":"1.売上高"},{"$f":"VLOOKUP(A36,科目体系マスタ!A:D,4,FALSE)","v":"1.売上高"}]
[5421,"給与(原)","予算","2017-05-01",18000000,{"$f":"VLOOKUP(A37,科目体系マスタ!A:D,3,FALSE)","v":"2.売上原価"},{"$f":"VLOOKUP(A37,科目体系マスタ!A:D,4,FALSE)","v":"4.固定費"}]
[5425,"法定福利費(原)","予算","2017-05-01",2520000.0000000005,{"$f":"VLOOKUP(A38,科目体系マスタ!A:D,3,FALSE)","v":"2.売上原価"},{"$f":"VLOOKUP(A38,科目体系マスタ!A:D,4,FALSE)","v":"4.固定費"}]
[5429,"外注委託費(原)","予算","2017-05-01",1500000,{"$f":"VLOOKUP(A39,科目体系マスタ!A:D,3,FALSE)","v":"2.売上原価"},{"$f":"VLOOKUP(A39,科目体系マスタ!A:D,4,FALSE)","v":"2.変動費"}]
[5452,"保険料(原)","予算","2017-05-01",20000,{"$f":"VLOOKUP(A40,科目体系マスタ!A:D,3,FALSE)","v":"2.売上原価"},{"$f":"VLOOKUP(A40,科目体系マスタ!A:D,4,FALSE)","v":"4.固定費"}]
{"$rows_left_out":375}
{"sheet":"利益体系Ａ参考","index":2,"n_rows":49,"n_cols":16,"rows_kept":49,"cut":false,"hidden":false,"merged":[]}
["データ名称","(すべて)"]
[]
["合計 / 金額",null,"列ラベル"]
["行ラベル","科目名称","2017-04-01","2017-05-01","2017-06-01","2017-07-01","2017-08-01","2017-09-01","2017-10-01","2017-11-01","2017-12-01","2018-01-01","2018-02-01","2018-03-01","(空白)","総計"]
["1.売上高","売上高",50000000,50000000,45000000,50000000,50000000,50000000,50000000,50000000,40000000,50000000,50000000,60000000,null,595000000]
["2.売上原価","運送費(原)",40000,40000,40000,40000,40000,40000,40000,40000,40000,40000,40000,40000,null,480000]
[null,"会議費(原)",85000,85000,85000,85000,85000,85000,85000,85000,85000,85000,85000,85000,null,1020000]
[null,"外注委託費(原)",1500000,1500000,1500000,1500000,1500000,1500000,1500000,1500000,null,null,null,null,null,12000000]
[null,"給与(原)",18000000,18000000,18000000,18000000,18000000,18000000,18000000,18000000,18000000,18000000,18000000,23000000,null,221000000]
[null,"書籍代(原)",50000,50000,50000,50000,50000,50000,50000,50000,50000,50000,50000,50000,null,600000]
[null,"消耗品費(原)",250000,250000,250000,250000,250000,250000,250000,250000,250000,250000,250000,550000,null,3300000]
[null,"通信費(原)",300000,300000,300000,300000,300000,300000,300000,300000,300000,300000,300000,300000,null,3600000]
[null,"保険料(原)",20000,20000,20000,20000,20000,20000,20000,20000,20000,20000,20000,20000,null,240000]
[null,"法定福利費(原)",2520000.0000000005,2520000.0000000005,2520000.0000000005,2520000.0000000005,2520000.0000000005,2520000.0000000005,2520000.0000000005,2520000.0000000005,2520000.0000000005,2520000.0000000005,2520000.0000000005,3220000.0000000005,null,30940000.000000004]
[null,"旅費交通費(原)",6020000,6220000,11220000,7050000,6650000,6650000,7500000,6950000,6350000,6920000,6320000,6720000,null,84570000]
["3.売上総利益",null,21215000,21015000,11015000,20185000,20585000,20585000,19735000,20285000,12385000,21815000,22415000,26015000,0,237250000]
["4.一般管理費","運送費",15000,15000,15000,15000,15000,15000,15000,15000,15000,15000,15000,15000,null,180000]
[null,"会議費",35400,35400,35400,35400,35400,35400,35400,35400,35400,35400,35400,35400,null,424800]
[null,"寄付金",null,null,null,30000,null,null,null,null,null,30000,null,null,null,60000]
[null,"給与手当(役員報酬除く）",9000000,9000000,9000000,9000000,9000000,9000000,9000000,9000000,9000000,9000000,9000000,9000000,null,108000000]
[null,"教育･トレーニング費",null,null,null,null,null,null,150000,null,null,null,null,500000,null,650000]
[null,"銀行手数料",5000,5000,5000,5000,5000,5000,5000,5000,5000,5000,5000,5000,null,60000]
[null,"減価償却費",290000,290000,290000,290000,290000,290000,290000,290000,290000,290000,290000,290000,null,3480000]
[null,"顧問報酬",300000,300000,300000,300000,300000,300000,300000,300000,300000,300000,300000,300000,null,3600000]
[null,"支払手数料",250000,500000,260000,250000,200000,300000,200000,200000,300000,250000,200000,300000,null,3210000]
[null,"修繕維持費",482000,532000,842000,482000,482000,882000,482000,482000,782000,482000,482000,982000,null,7394000]
[null,"諸会費",null,null,null,null,60000,20000,60000,null,null,null,null,60000,null,200000]
[null,"消耗品費",377000,252000,252000,252000,252000,252000,377000,252000,252000,252000,252000,252000,null,3274000]
[null,"紹介手数料",null,null,null,null,null,null,630000,null,null,null,null,630000,null,1260000]
[null,"新聞図書費",9700,9700,9700,9700,9700,14700,9700,9700,9700,9700,9700,14700,null,126400]
[null,"水道光熱費",45000,45000,45000,45000,45000,45000,45000,45000,45000,45000,45000,45000,null,540000]
[null,"接待交際費",50000,50000,50000,50000,50000,50000,50000,50000,50000,50000,50000,50000,null,600000]
[null,"租税公課",null,null,600000,15000,null,50000,null,null,null,null,null,50000,null,715000]
[null,"貸倒引当金繰入",null,null,null,null,null,null,null,null,null,null,null,200000,null,200000]
[null,"賃借料",1029600,1029600,1029600,1029600,1029600,1029600,1029600,1029600,1029600,1029600,1029600,1029600,null,12355200]
[null,"通信費",43000,43000,43000,43000,43000,43000,43000,43000,43000,43000,43000,43000,null,516000]
[null,"販促・広告費",135000,null,null,500000,null,null,135000,null,null,500000,null,null,null,1270000]
[null,"福利厚生費",226000,226000,226000,226000,226000,268000,226000,226000,426000,268000,226000,226000,null,2996000]
[null,"保険料",null,null,null,1400000,null,null,null,null,null,40000,null,null,null,1440000]
[null,"法定福利費",1170000,1170000,1170000,1170000,1170000,1170000,1170000,1170000,1170000,1170000,1170000,1170000,null,14040000]
{"$rows_left_out":10}
{"sheet":"利益体系Ｂ参考","index":3,"n_rows":49,"n_cols":16,"rows_kept":49,"cut":false,"hidden":false,"merged":[]}
["データ名称","(すべて)"]
[]
["合計 / 金額",null,"列ラベル"]
["行ラベル","科目名称","2017-04-01","2017-05-01","2017-06-01","2017-07-01","2017-08-01","2017-09-01","2017-10-01","2017-11-01","2017-12-01","2018-01-01","2018-02-01","2018-03-01","(空白)","総計"]
["1.売上高","売上高",50000000,50000000,45000000,50000000,50000000,50000000,50000000,50000000,40000000,50000000,50000000,60000000,null,595000000]
["2.変動費","運送費(原)",40000,40000,40000,40000,40000,40000,40000,40000,40000,40000,40000,40000,null,480000]
[null,"会議費(原)",85000,85000,85000,85000,85000,85000,85000,85000,85000,85000,85000,85000,null,1020000]
[null,"外注委託費(原)",1500000,1500000,1500000,1500000,1500000,1500000,1500000,1500000,null,null,null,null,null,12000000]
[null,"書籍代(原)",50000,50000,50000,50000,50000,50000,50000,50000,50000,50000,50000,50000,null,600000]
[null,"消耗品費(原)",250000,250000,250000,250000,250000,250000,250000,250000,250000,250000,250000,550000,null,3300000]
[null,"紹介手数料",null,null,null,null,null,null,630000,null,null,null,null,630000,null,1260000]
[null,"貸倒引当金繰入",null,null,null,null,null,null,null,null,null,null,null,200000,null,200000]
[null,"旅費交通費(原)",6020000,6220000,11220000,7050000,6650000,6650000,7500000,6950000,6350000,6920000,6320000,6720000,null,84570000]
["3.貢献利益",null,42055000,41855000,31855000,41025000,41425000,41425000,39945000,41125000,33225000,42655000,43255000,51725000,0,491570000]
["4.固定費","運送費",15000,15000,15000,15000,15000,15000,15000,15000,15000,15000,15000,15000,null,180000]
[null,"会議費",35400,35400,35400,35400,35400,35400,35400,35400,35400,35400,35400,35400,null,424800]
[null,"寄付金",null,null,null,30000,null,null,null,null,null,30000,null,null,null,60000]
[null,"給与(原)",18000000,18000000,18000000,18000000,18000000,18000000,18000000,18000000,18000000,18000000,18000000,23000000,null,221000000]
[null,"給与手当(役員報酬除く）",9000000,9000000,9000000,9000000,9000000,9000000,9000000,9000000,9000000,9000000,9000000,9000000,null,108000000]
[null,"教育･トレーニング費",null,null,null,null,null,null,150000,null,null,null,null,500000,null,650000]
[null,"銀行手数料",5000,5000,5000,5000,5000,5000,5000,5000,5000,5000,5000,5000,null,60000]
[null,"減価償却費",290000,290000,290000,290000,290000,290000,290000,290000,290000,290000,290000,290000,null,3480000]
[null,"顧問報酬",300000,300000,300000,300000,300000,300000,300000,300000,300000,300000,300000,300000,null,3600000]
[null,"支払手数料",250000,500000,260000,250000,200000,300000,200000,200000,300000,250000,200000,300000,null,3210000]
[null,"修繕維持費",482000,532000,842000,482000,482000,882000,482000,482000,782000,482000,482000,982000,null,7394000]
[null,"諸会費",null,null,null,null,60000,20000,60000,null,null,null,null,60000,null,200000]
[null,"消耗品費",377000,252000,252000,252000,252000,252000,377000,252000,252000,252000,252000,252000,null,3274000]
[null,"新聞図書費",9700,9700,9700,9700,9700,14700,9700,9700,9700,9700,9700,14700,null,126400]
[null,"水道光熱費",45000,45000,45000,45000,45000,45000,45000,45000,45000,45000,45000,45000,null,540000]
[null,"接待交際費",50000,50000,50000,50000,50000,50000,50000,50000,50000,50000,50000,50000,null,600000]
[null,"租税公課",null,null,600000,15000,null,50000,null,null,null,null,null,50000,null,715000]
[null,"賃借料",1029600,1029600,1029600,1029600,1029600,1029600,1029600,1029600,1029600,1029600,1029600,1029600,null,12355200]
[null,"通信費",43000,43000,43000,43000,43000,43000,43000,43000,43000,43000,43000,43000,null,516000]
[null,"通信費(原)",300000,300000,300000,300000,300000,300000,300000,300000,300000,300000,300000,300000,null,3600000]
[null,"販促・広告費",135000,null,null,500000,null,null,135000,null,null,500000,null,null,null,1270000]
[null,"福利厚生費",226000,226000,226000,226000,226000,268000,226000,226000,426000,268000,226000,226000,null,2996000]
[null,"保険料",null,null,null,1400000,null,null,null,null,null,40000,null,null,null,1440000]
[null,"保険料(原)",20000,20000,20000,20000,20000,20000,20000,20000,20000,20000,20000,20000,null,240000]
[null,"法定福利費",1170000,1170000,1170000,1170000,1170000,1170000,1170000,1170000,1170000,1170000,1170000,1170000,null,14040000]
[null,"法定福利費(原)",2520000.0000000005,2520000.0000000005,2520000.0000000005,2520000.0000000005,2520000.0000000005,2520000.0000000005,2520000.0000000005,2520000.0000000005,2520000.0000000005,2520000.0000000005,2520000.0000000005,3220000.0000000005,null,30940000.000000004]
{"$rows_left_out":10}
{"sheet":"科目体系マスタ","index":4,"n_rows":51,"n_cols":4,"rows_kept":51,"cut":false,"hidden":false,"merged":[]}
["コード","科目名","科目体系Ａ","科目体系Ｂ"]
[4111,"売上高","1.売上高","1.売上高"]
[5421,"給与(原)            ","2.売上原価","4.固定費"]
[5423,"賞与(原)            ","2.売上原価","2.変動費"]
[5425,"法定福利費(原)      ","2.売上原価","4.固定費"]
[5429,"外注委託費(原)      ","2.売上原価","2.変動費"]
[5442,"賃借料(原)          ","2.売上原価","4.固定費"]
[5452,"保険料(原)          ","2.売上原価","4.固定費"]
[5455,"旅費交通費(原)      ","2.売上原価","2.変動費"]
[5456,"通信費(原)          ","2.売上原価","4.固定費"]
[5457,"接待交際費(原)","2.売上原価","4.固定費"]
[5458,"消耗品費(原)        ","2.売上原価","2.変動費"]
[5459,"運送費(原)          ","2.売上原価","2.変動費"]
[5460,"会議費(原)          ","2.売上原価","2.変動費"]
[5461,"書籍代(原)          ","2.売上原価","2.変動費"]
[5479,"雑費(原)","2.売上原価","2.変動費"]
[5600,"その他（原）","2.売上原価","2.変動費"]
[6111,"役員報酬            ","4.一般管理費","4.固定費"]
[6112,"給与手当(役員報酬除く）","4.一般管理費","4.固定費"]
[6114,"賞与                ","4.一般管理費","2.変動費"]
[6116,"法定福利費          ","4.一般管理費","4.固定費"]
[6117,"福利厚生費          ","4.一般管理費","4.固定費"]
[6122,"顧問報酬            ","4.一般管理費","4.固定費"]
[6211,"派遣社員","4.一般管理費","2.変動費"]
[6212,"消耗品費            ","4.一般管理費","4.固定費"]
[6213,"賃借料              ","4.一般管理費","4.固定費"]
[6215,"保険料              ","4.一般管理費","4.固定費"]
[6216,"修繕維持費          ","4.一般管理費","4.固定費"]
[6217,"租税公課            ","4.一般管理費","4.固定費"]
[6218,"減価償却費          ","4.一般管理費","4.固定費"]
[6219,"貸倒引当金繰入      ","4.一般管理費","2.変動費"]
[6221,"旅費交通費          ","4.一般管理費","4.固定費"]
[6222,"通信費              ","4.一般管理費","4.固定費"]
[6223,"会議費              ","4.一般管理費","4.固定費"]
[6224,"水道光熱費          ","4.一般管理費","4.固定費"]
[6225,"支払手数料          ","4.一般管理費","4.固定費"]
[6226,"新聞図書費          ","4.一般管理費","4.固定費"]
[6227,"銀行手数料          ","4.一般管理費","4.固定費"]
[6228,"販促・広告費        ","4.一般管理費","4.固定費"]
[6229,"接待交際費          ","4.一般管理費","4.固定費"]
{"$rows_left_out":11}